BDBM228198 1-{(R)-4-[4-(2-Cyclopropyl-pyrimidin-5-yl)-2-trifluoromethyl-thiazol-5-yl]-2-methyl-piperazin-1-yl}-2-(3-methyl-[1,2,4]triazol-1-yl)-ethanone::US10047080, 21
SMILES CC1CNCC(N1C(=O)Cn1cnc(C)n1)c1sc(cc1-c1cnc(nc1)C1CC1)C(F)(F)F
InChI Key InChIKey=XSQPYHLKSJDSPW-UHFFFAOYSA-N
Data  2 IC50
  Tab Delimited (TSV)   2D SDfile   Computed 3D by Vconf -m prep SDfile
Find this compound or compounds like it in BindingDB:
Activity Spreadsheet -- Enzyme Inhibition Constant Data from BindingDB
Found 2 hits for monomerid = 228198
TargetC-X-C chemokine receptor type 3(Homo sapiens (Human))
Idorsia Pharmaceuticals
US Patent
LigandPNGBDBM228198(1-{(R)-4-[4-(2-Cyclopropyl-pyrimidin-5-yl)-2-trifl...)
Affinity DataIC50:  462nM. Assay description: Stock solutions of test compounds are made up at a concentration of 10 mM in DMSO, and serially diluted in PBS containing 0.5% BSA to concentrations ...
Ligand InfoPC cidPC sid
In DepthDetails US Patent
TargetC-X-C chemokine receptor type 3(Homo sapiens (Human))
Idorsia Pharmaceuticals
US Patent
LigandPNGBDBM228198(1-{(R)-4-[4-(2-Cyclopropyl-pyrimidin-5-yl)-2-trifl...)
Affinity DataIC50:  5.20nMpH: 7.4Assay Description:The bioactivity of compounds is tested in a fluorometric imaging plate reader (FLIPR: Molecular Devices) using engineered CHO-K1 cells expressing the...
Ligand InfoPC cidPC sid
In DepthDetails US Patent