BDBM230191 US9340500, I-035
SMILES CN(CCCn1c(C)c(cc1-c1ccccc1)C(=O)Nc1cccc(c1)C(F)(F)F)CC[C@H](O)[C@H](O)CO
InChI Key InChIKey=SSKRMYZLCJDNQP-IZZNHLLZSA-N
Data  1 KI
  Tab Delimited (TSV)   2D SDfile   Computed 3D by Vconf -m prep SDfile
Find this compound or compounds like it in BindingDB:
Activity Spreadsheet -- Enzyme Inhibition Constant Data from BindingDB
Found 1 hit for monomerid = 230191
TargetTransient receptor potential cation channel subfamily V member 4(Homo sapiens (Human))
Shionogi
US Patent
LigandPNGBDBM230191(US9340500, I-035)
Affinity DataKi:  771nM ΔG°:  -8.67kcal/moleT: 2°C. Assay description: Test Example 3: (1) The TRPV4 inhibitory activity was measured using CHO-K1 cells stably expressing human TRPV4 (hTRPV4/CHO cells). (2) Frozen cells ...
Ligand InfoPC cidPC sid
In DepthDetails US Patent