BDBM230859 US9346793, 10
SMILES Cc1nc(C(=O)Nc2cnn(Cc3nc(co3)C(C)(C)O)n2)c(o1)-c1ccccc1
InChI Key InChIKey=PBPOKNAZEDJSCU-UHFFFAOYSA-N
Data  1 EC50
  Tab Delimited (TSV)   2D SDfile   Computed 3D by Vconf -m prep SDfile
Find this compound or compounds like it in BindingDB:
Activity Spreadsheet -- Enzyme Inhibition Constant Data from BindingDB
Found 1 hit for monomerid = 230859
TargetGuanine nucleotide-binding protein subunit alpha-15 [Y147C]/N-formyl peptide receptor 2(Homo sapiens (Human))
Actelion Pharmaceuticals
US Patent
LigandPNGBDBM230859(US9346793, 10)
Affinity DataEC50:  10.3nM. Assay description: Cells expressing recombinant human ALX receptor and the G-protein Gα16 (HEK293-hALXR-Gα16) were grown to 80% confluency in Growing Medium (...
Ligand InfoPC cidPC sid
In DepthDetails US Patent