BDBM231684 3-(4-(1-(4-Methoxyphenyl)-4,5-diphenyl-1H-imidazol-2-yl)-1- phenyl-1H-pyrazol-3-yl)-4a,8a-dihydro-2H-chromen-2-one (3c)
SMILES COc1ccc(cc1)-n1c(nc(c1-c1ccccc1)-c1ccccc1)-c1cn(nc1C1=CC2C=CC=CC2OC1=O)-c1ccccc1
InChI Key InChIKey=KFQAWYCDWIJDII-UHFFFAOYSA-N
Data  1 IC50
  Tab Delimited (TSV)   2D SDfile   Computed 3D by Vconf -m prep SDfile
Find this compound or compounds like it in BindingDB:
Activity Spreadsheet -- Enzyme Inhibition Constant Data from BindingDB
Found 1 hit for monomerid = 231684
TargetAlpha-glucosidase MAL32(Saccharomyces cerevisiae (Baker's yeast))
Kinnaird College For Women
LigandPNGBDBM231684(3-(4-(1-(4-Methoxyphenyl)-4,5-diphenyl-1H-imidazol...)
Affinity DataIC50:  2.54E+4nMpH: 6.8 T: 2°C. Assay description: For α-glucosidase inhibition assay, α-glucosidase enzyme (Cat No. 5003-1KU Type I; isolated from Saccharomyces cereviciae) was used. Acarbo...
Ligand InfoPC cidPC sid
In DepthDetails ArticlePubMed