BDBM233787 US9353075, 30
SMILES C[C@@H]1OC(=O)[C@@H]1NC(=O)OC1CCC(Cc2ccccc2)CC1
InChI Key InChIKey=QNWDMPXQYBUVNW-HOJRLLLISA-N
Data  1 IC50
  Tab Delimited (TSV)   2D SDfile   Computed 3D by Vconf -m prep SDfile
Find this compound or compounds like it in BindingDB:
Activity Spreadsheet -- Enzyme Inhibition Constant Data from BindingDB
Found 1 hit for monomerid = 233787
TargetN-acylethanolamine-hydrolyzing acid amidase(Rattus norvegicus (Rat))
University Of California
US Patent
LigandPNGBDBM233787(US9353075, 30)
Affinity DataIC50:  310nMpH: 7.4Assay Description:Lysosomal NAAA protein preparation were obtained by homogenizing male Sprague-Dawley rat lungs (Charles River) in 20 mM Tris-HCl buffer pH 7.4 contai...
Ligand InfoPC cidPC sid
In DepthDetails US Patent