BDBM2341 Isopropyl 1-[(2-Amino-5-chlorophenyl)sulfonyl]-1Hpyrrole-2-carboxylate::Pyrrolyl Aryl Sulfone (PAS) 8h::propan-2-yl 1-[(2-amino-5-chlorobenzene)sulfonyl]-1H-pyrrole-2-carboxylate
SMILES CC(C)OC(=O)c1cccn1S(=O)(=O)c1cc(Cl)ccc1N
InChI Key InChIKey=XYFHUOSUAQXPEP-UHFFFAOYSA-N
Data  3 IC50
  Tab Delimited (TSV)   2D SDfile   Computed 3D by Vconf -m prep SDfile
Find this compound or compounds like it in BindingDB:
Activity Spreadsheet -- Enzyme Inhibition Constant Data from BindingDB
Found 3 hits for monomerid = 2341
TargetGag-Pol polyprotein [588-1027]/[588-1147](Human immunodeficiency virus type 1)
Universita Di Roma
LigandPNGBDBM2341(Isopropyl 1-[(2-Amino-5-chlorophenyl)sulfonyl]-1Hp...)
Affinity DataIC50:  270nMpH: 7.8 T: 2°C. Assay description: The IC50 of reverse transcriptase is the concentration that inhibits 50% of recombinant HIV RT RNA-directed DNA polymerase activity in vitro.
In DepthDetails ArticlePubMed
TargetGag-Pol polyprotein [588-1127,L687I]/[588-1147,L687I](Human immunodeficiency virus type 1)
Universita Di Roma
LigandPNGBDBM2341(Isopropyl 1-[(2-Amino-5-chlorophenyl)sulfonyl]-1Hp...)
Affinity DataIC50:  1.40E+4nMpH: 7.8 T: 2°C. Assay description: The IC50 of reverse transcriptase is the concentration that inhibits 50% of recombinant HIV RT RNA-directed DNA polymerase activity in vitro.
In DepthDetails ArticlePubMed
TargetGag-Pol polyprotein [588-1127,Y768C]/[588-1147,Y768C](Human immunodeficiency virus type 1)
Universita Di Roma
LigandPNGBDBM2341(Isopropyl 1-[(2-Amino-5-chlorophenyl)sulfonyl]-1Hp...)
Affinity DataIC50:  8.00E+3nMpH: 7.8 T: 2°C. Assay description: The IC50 of reverse transcriptase is the concentration that inhibits 50% of recombinant HIV RT RNA-directed DNA polymerase activity in vitro.
In DepthDetails ArticlePubMed