BDBM23413 5-hydroxy-7-methoxy-2-(4-methoxyphenyl)-4H-chromen-4-one::Apigenin-7,4'-dimethylether::Genkwanin::apigenin dimethylether
SMILES COc1ccc(cc1)-c1cc(=O)c2c(O)cc(OC)cc2o1
InChI Key InChIKey=LZERJKGWTQYMBB-UHFFFAOYSA-N
Data  1 IC50  1 Other
  Tab Delimited (TSV)   2D SDfile   Computed 3D by Vconf -m prep SDfile
Find this compound or compounds like it in BindingDB:
Activity Spreadsheet -- Enzyme Inhibition Constant Data from BindingDB
Found 2 hits for monomerid = 23413
TargetMitogen-activated protein kinase 14(Homo sapiens (Human))
Eberhard Karls University Of Tuebingen
LigandPNGBDBM23413(5-hydroxy-7-methoxy-2-(4-methoxyphenyl)-4H-chromen...)
Affinity DataIC50:  2.78E+4nMT: 2°C. Assay description: The p38alpha reaction was carried out by using kinase (12ng per well), ATP (100uM) and incubated for 60 min at 37 C. For the JNK3 assay, kinase (10n...
In DepthDetails ArticlePubMed
TargetAlpha-amylase 1A(Homo sapiens (Human))
Nestle Research Center
LigandPNGBDBM23413(5-hydroxy-7-methoxy-2-(4-methoxyphenyl)-4H-chromen...)
Affinity DatapH: 6.0 T: 2°C. Assay description: The assay was carried out at room temperature for 10 min with salivary alpha-amylase, starch, and test compounds. The reducing sugar was determined b...
In DepthDetails ArticlePubMed