BDBM234835 US9353104, 140
SMILES COc1ccc(nc1)[C@H]1C[C@@H]1COc1nn(C)c(=O)c(NCc2nnc(C)s2)c1Br
InChI Key InChIKey=AYUHZWKISCHSME-YPMHNXCESA-N
Data  1 KI
  Tab Delimited (TSV)   2D SDfile   Computed 3D by Vconf -m prep SDfile
Find this compound or compounds like it in BindingDB:
Activity Spreadsheet -- Enzyme Inhibition Constant Data from BindingDB
Found 1 hit for monomerid = 234835
LigandPNGBDBM234835(US9353104, 140)
Affinity DataKi:  0.00400nM. Assay description: The fluorescence polarization assay for cyclic nucleotide phosphodiesterases was performed using an IMAP® FP kit supplied by Molecular Devices, Sunny...
Ligand InfoPC cidPC sid
In DepthDetails US Patent