BDBM238089 US9394285, 184
SMILES COc1nc(ccc1-c1cc2c(c[nH]c2cc1Cl)C(O)=O)N1CC[C@H](O)C1
InChI Key
Data  1 EC50
  Tab Delimited (TSV)   2D SDfile   Computed 3D by Vconf -m prep SDfile
Find this compound or compounds like it in BindingDB:
Activity Spreadsheet -- Enzyme Inhibition Constant Data from BindingDB
Found 1 hit for monomerid = 238089
LigandPNGBDBM238089(US9394285, 184)
Affinity DataEC50:  6.20nMpH: 7.5 T: 2°C. Assay description: The biochemical EC50 (half-maximal concentration required for full activation) of compounds for the activation of AMPK was evaluated by 33P-based ass...
Ligand InfoPC cidPC sid
In DepthDetails US Patent