BDBM23904 3-[(2S)-3-[4-(2-carbamimidamidoethyl)piperidin-1-yl]-2-[(4-cyclohexylbenzene)sulfonamido]-3-oxopropyl]benzene-1-carboximidamide::3-amidinophenylalanine deriv., 47
SMILES [#7]\[#6](-[#7])=[#7]/[#6]-[#6]-[#6]-1-[#6]-[#6]-[#7](-[#6]-[#6]-1)-[#6](=O)-[#6@H](-[#6]-c1cccc(c1)-[#6](-[#7])=[#7])-[#7]S(=O)(=O)c1ccc(cc1)-[#6]-1-[#6]-[#6]-[#6]-[#6]-[#6]-1
InChI Key InChIKey=JYJDBVCYQJCOFY-MHZLTWQESA-N
Data  5 KI
  Tab Delimited (TSV)   2D SDfile   Computed 3D by Vconf -m prep SDfile
Find this compound or compounds like it in BindingDB:
Activity Spreadsheet -- Enzyme Inhibition Constant Data from BindingDB
Found 5 hits for monomerid = 23904
TargetProthrombin(Bos taurus (Bovine))
Curacyte Chemistry
LigandPNGBDBM23904(3-[(2S)-3-[4-(2-carbamimidamidoethyl)piperidin-1-y...)
Affinity DataKi:  51nM. Assay description: The measurements were carried out on a microplate reader. Two concentrations of the substrate and five concentrations of the inhibitor were used. Af...
In DepthDetails ArticlePubMed
TargetSuppressor of tumorigenicity 14 protein(Homo sapiens (Human))
Curacyte Chemistry
LigandPNGBDBM23904(3-[(2S)-3-[4-(2-carbamimidamidoethyl)piperidin-1-y...)
Affinity DataKi:  88nM. Assay description: The measurements were carried out on a microplate reader. Two concentrations of the substrate and five concentrations of the inhibitor were used. Af...
In DepthDetails ArticlePubMed
TargetCoagulation factor X(Bos taurus)
Curacyte Chemistry
LigandPNGBDBM23904(3-[(2S)-3-[4-(2-carbamimidamidoethyl)piperidin-1-y...)
Affinity DataKi:  1.80E+3nM. Assay description: The measurements were carried out on a microplate reader. Two concentrations of the substrate and five concentrations of the inhibitor were used. Af...
In DepthDetails ArticlePubMed
TargetUrokinase-type plasminogen activator(Homo sapiens (Human))
Curacyte Chemistry
LigandPNGBDBM23904(3-[(2S)-3-[4-(2-carbamimidamidoethyl)piperidin-1-y...)
Affinity DataKi:  1.90E+3nM. Assay description: The measurements were carried out on a microplate reader. Two concentrations of the substrate and five concentrations of the inhibitor were used. Af...
In DepthDetails ArticlePubMed
TargetPlasminogen(Homo sapiens (Human))
Curacyte Chemistry
LigandPNGBDBM23904(3-[(2S)-3-[4-(2-carbamimidamidoethyl)piperidin-1-y...)
Affinity DataKi:  2.00E+3nM. Assay description: The measurements were carried out on a microplate reader. Two concentrations of the substrate and five concentrations of the inhibitor were used. Af...
In DepthDetails ArticlePubMed