BDBM23906 3-[(2S)-3-[4-(3-aminopropyl)piperidin-1-yl]-2-(naphthalene-2-sulfonamido)-3-oxopropyl]benzene-1-carboximidamide::3-amidinophenylalanine deriv., 49
SMILES NCCCC1CCN(CC1)C(=O)[C@H](Cc1cccc(c1)C(N)=N)NS(=O)(=O)c1ccc2ccccc2c1
InChI Key InChIKey=XZWRXRGAHZNWCO-SANMLTNESA-N
Data  5 KI
  Tab Delimited (TSV)   2D SDfile   Computed 3D by Vconf -m prep SDfile
Find this compound or compounds like it in BindingDB:
Activity Spreadsheet -- Enzyme Inhibition Constant Data from BindingDB
Found 5 hits for monomerid = 23906
TargetSuppressor of tumorigenicity 14 protein(Homo sapiens (Human))
Curacyte Chemistry
LigandPNGBDBM23906(3-[(2S)-3-[4-(3-aminopropyl)piperidin-1-yl]-2-(nap...)
Affinity DataKi:  160nM. Assay description: The measurements were carried out on a microplate reader. Two concentrations of the substrate and five concentrations of the inhibitor were used. Af...
In DepthDetails ArticlePubMed
TargetProthrombin(Bos taurus (Bovine))
Curacyte Chemistry
LigandPNGBDBM23906(3-[(2S)-3-[4-(3-aminopropyl)piperidin-1-yl]-2-(nap...)
Affinity DataKi:  600nM. Assay description: The measurements were carried out on a microplate reader. Two concentrations of the substrate and five concentrations of the inhibitor were used. Af...
In DepthDetails ArticlePubMed
TargetPlasminogen(Homo sapiens (Human))
Curacyte Chemistry
LigandPNGBDBM23906(3-[(2S)-3-[4-(3-aminopropyl)piperidin-1-yl]-2-(nap...)
Affinity DataKi:  730nM. Assay description: The measurements were carried out on a microplate reader. Two concentrations of the substrate and five concentrations of the inhibitor were used. Af...
In DepthDetails ArticlePubMed
TargetUrokinase-type plasminogen activator(Homo sapiens (Human))
Curacyte Chemistry
LigandPNGBDBM23906(3-[(2S)-3-[4-(3-aminopropyl)piperidin-1-yl]-2-(nap...)
Affinity DataKi:  2.10E+3nM. Assay description: The measurements were carried out on a microplate reader. Two concentrations of the substrate and five concentrations of the inhibitor were used. Af...
In DepthDetails ArticlePubMed
TargetCoagulation factor X(Bos taurus)
Curacyte Chemistry
LigandPNGBDBM23906(3-[(2S)-3-[4-(3-aminopropyl)piperidin-1-yl]-2-(nap...)
Affinity DataKi:  6.60E+4nM. Assay description: The measurements were carried out on a microplate reader. Two concentrations of the substrate and five concentrations of the inhibitor were used. Af...
In DepthDetails ArticlePubMed