BDBM23914 3-amidinophenylalanine deriv., 57::3-amino-N-(4-{[(2S)-1-[4-(2-aminoethyl)piperidin-1-yl]-3-(3-carbamimidoylphenyl)-1-oxopropan-2-yl]sulfamoyl}phenyl)propanamide
SMILES NCCC1CCN(CC1)C(=O)[C@H](Cc1cccc(c1)C(N)=N)NS(=O)(=O)c1ccc(NC(=O)CCN)cc1
InChI Key InChIKey=IUZFOKCCMJNLLQ-QHCPKHFHSA-N
Data  5 KI
  Tab Delimited (TSV)   2D SDfile   Computed 3D by Vconf -m prep SDfile
Find this compound or compounds like it in BindingDB:
Activity Spreadsheet -- Enzyme Inhibition Constant Data from BindingDB
Found 5 hits for monomerid = 23914
TargetSuppressor of tumorigenicity 14 protein(Homo sapiens (Human))
Curacyte Chemistry
LigandPNGBDBM23914(3-amidinophenylalanine deriv., 57 | 3-amino-N-(4-{...)
Affinity DataKi:  28nM. Assay description: The measurements were carried out on a microplate reader. Two concentrations of the substrate and five concentrations of the inhibitor were used. Af...
In DepthDetails ArticlePubMed
TargetUrokinase-type plasminogen activator(Homo sapiens (Human))
Curacyte Chemistry
LigandPNGBDBM23914(3-amidinophenylalanine deriv., 57 | 3-amino-N-(4-{...)
Affinity DataKi:  820nM. Assay description: The measurements were carried out on a microplate reader. Two concentrations of the substrate and five concentrations of the inhibitor were used. Af...
In DepthDetails ArticlePubMed
TargetPlasminogen(Homo sapiens (Human))
Curacyte Chemistry
LigandPNGBDBM23914(3-amidinophenylalanine deriv., 57 | 3-amino-N-(4-{...)
Affinity DataKi:  1.20E+3nM. Assay description: The measurements were carried out on a microplate reader. Two concentrations of the substrate and five concentrations of the inhibitor were used. Af...
In DepthDetails ArticlePubMed
TargetProthrombin(Bos taurus (Bovine))
Curacyte Chemistry
LigandPNGBDBM23914(3-amidinophenylalanine deriv., 57 | 3-amino-N-(4-{...)
Affinity DataKi:  8.80E+3nM. Assay description: The measurements were carried out on a microplate reader. Two concentrations of the substrate and five concentrations of the inhibitor were used. Af...
In DepthDetails ArticlePubMed
TargetCoagulation factor X(Bos taurus)
Curacyte Chemistry
LigandPNGBDBM23914(3-amidinophenylalanine deriv., 57 | 3-amino-N-(4-{...)
Affinity DataKi:  1.50E+4nM. Assay description: The measurements were carried out on a microplate reader. Two concentrations of the substrate and five concentrations of the inhibitor were used. Af...
In DepthDetails ArticlePubMed