BDBM23943 1,3-difluoro-5-[(Z)-2-(4-fluorophenyl)ethenyl]benzene::cis-Stilbene Derivative, 5d
SMILES Fc1ccc(\C=C/c2cc(F)cc(F)c2)cc1
InChI Key InChIKey=AISCLLWJTMIDPD-UPHRSURJSA-N
Data  3 KI
  Tab Delimited (TSV)   2D SDfile   Computed 3D by Vconf -m prep SDfile
Find this compound or compounds like it in BindingDB:
Activity Spreadsheet -- Enzyme Inhibition Constant Data from BindingDB
Found 3 hits for monomerid = 23943
TargetAryl hydrocarbon receptor(Oryctolagus cuniculus (rabbit))
Institut Claudius Regaud
LigandPNGBDBM23943(1,3-difluoro-5-[(Z)-2-(4-fluorophenyl)ethenyl]benz...)
Affinity DataKi:  63nM ΔG°:  -9.12kcal/molepH: 7.6 T: 2°C. Assay description: Cytosols from rabbit liver were incubated with [3H]-TCDD and 12 concentrations of unlabeled test ligands. IC50 values were determined using the itera...
In DepthDetails ArticlePubMed
TargetEstrogen receptor(Homo sapiens (Human))
Institut Claudius Regaud
LigandPNGBDBM23943(1,3-difluoro-5-[(Z)-2-(4-fluorophenyl)ethenyl]benz...)
Affinity DataKi: >1.00E+5nM. Assay description: Cytosols from MCF-7 cells expressed ER-alpha isoform were incubated with [3H]-estradiol and eight concentrations of unlabeled test ligands. IC50 val...
In DepthDetails ArticlePubMed
TargetAryl hydrocarbon receptor(Homo sapiens (Human))TBA
LigandPNGBDBM23943(1,3-difluoro-5-[(Z)-2-(4-fluorophenyl)ethenyl]benz...)
Affinity DataKi:  1.59E+7nM. Assay description: Binding affinity to aryl hydrocarbon receptor (unknown origin)
In DepthDetails Article