BDBM239619 US9394309, 72
SMILES COc1ccc(NC(=O)c2cccc(c2)S(F)(F)(F)(F)F)cc1-n1ccn2nc(cc12)-c1cccnc1
InChI Key InChIKey=OVKJTJUQKSVOIO-UHFFFAOYSA-N
Data  1 IC50
  Tab Delimited (TSV)   2D SDfile   Computed 3D by Vconf -m prep SDfile
Find this compound or compounds like it in BindingDB:
Activity Spreadsheet -- Enzyme Inhibition Constant Data from BindingDB
Found 1 hit for monomerid = 239619
TargetAngiopoietin-1 receptor [776-1124](Homo sapiens (Human))
Bayer Pharma Aktiengesellschaft
US Patent
LigandPNGBDBM239619(US9394309, 72)
Affinity DataIC50:  350nMpH: 7.0 T: 2°C. Assay description: For the assay, 50 nl of a 100-fold concentrated solution of the respective test substance in DMSO were pipetted into a black low-volume 384-well micr...
Ligand InfoPC cidPC sid
In DepthDetails US Patent