BDBM24 (4R,5S,6S,7R)-4,7-dibenzyl-1-(cyclopropylmethyl)-5,6-dihydroxy-3-(6-hydroxyhexyl)-1,3-diazepan-2-one::DMPC Cyclic Urea 4
SMILES OCCCCCCN1[C@H](Cc2ccccc2)[C@H](O)[C@@H](O)[C@@H](Cc2ccccc2)N(CC2CC2)C1=O
InChI Key InChIKey=YXVAZXDWVZTGGD-VIJSPRBVSA-N
Data  1 KI
  Tab Delimited (TSV)   2D SDfile   Computed 3D by Vconf -m prep SDfile
Find this compound or compounds like it in BindingDB:
Activity Spreadsheet -- Enzyme Inhibition Constant Data from BindingDB
Found 1 hit for monomerid = 24
TargetDimer of Gag-Pol polyprotein [501-599](Human immunodeficiency virus type 1)
Dupont Pharmaceuticals
LigandPNGBDBM24((4R,5S,6S,7R)-4,7-dibenzyl-1-(cyclopropylmethyl)-5...)
Affinity DataKi:  0.800nM ΔG°:  -12.9kcal/molepH: 5.5 T: 2°C. Assay description: Ki values were determined with recombinant single-chain dimeric HIV protease and a fluorescent substrate. The use of single-chain dimeric protease a...
In DepthDetails ArticlePubMed