BDBM24062 2-hydroxyethyl N-[(2S)-1-[(2S)-4-(2,5-difluorophenyl)-2-phenyl-2,5-dihydro-1H-pyrrol-1-yl]-3,3-dimethyl-1-oxobutan-2-yl]carbamate::CHEMBL202788::dihydropyrrole, 21
SMILES [H][C@]1(C=C(CN1C(=O)[C@@H](NC(=O)OCCO)C(C)(C)C)c1cc(F)ccc1F)c1ccccc1
InChI Key InChIKey=RWUSOKGVCNRFRC-FCHUYYIVSA-N
Data  3 IC50
  Tab Delimited (TSV)   2D SDfile   Computed 3D by Vconf -m prep SDfile
Find this compound or compounds like it in BindingDB:
Activity Spreadsheet -- Enzyme Inhibition Constant Data from BindingDB
Found 3 hits for monomerid = 24062
TargetA disintegrin and metalloproteinase with thrombospondin motifs 5(Homo sapiens (Human))
Merck Research Laboratories
LigandPNGBDBM24062(2-hydroxyethyl N-[(2S)-1-[(2S)-4-(2,5-difluorophen...)
Affinity DataIC50:  7.40nMpH: 7.0 T: 2°C. Assay description: The kinesin motor domain is incubated with microtubules, 1 mM ATP (1: 1 MgCl2 : Na-ATP), and compound at 23°C in buffer. After reaction was term...
In DepthDetails ArticlePubMed
TargetKinesin-like protein KIF11(Homo sapiens (Human))
China Pharmaceutical University
Curated by ChEMBL
LigandPNGBDBM24062(2-hydroxyethyl N-[(2S)-1-[(2S)-4-(2,5-difluorophen...)
Affinity DataIC50:  7.40nM. Assay description: Inhibition of KSP
In DepthDetails ArticlePubMed
TargetPotassium voltage-gated channel subfamily H member 2(Homo sapiens (Human))
Merck Research Laboratories
LigandPNGBDBM24062(2-hydroxyethyl N-[(2S)-1-[(2S)-4-(2,5-difluorophen...)
Affinity DataIC50:  2.50E+4nMpH: 7.4 T: 2°C. Assay description: The hERG IC50 values were determined by radioligand competition experiments using membrane preparations from human embryonic kidney cells that stably...
In DepthDetails ArticlePubMed