BDBM24115 [4-(7,8-dimethyl-4-phenyl-1,2,3,4-tetrahydroisoquinolin-2-yl)butyl]dimethylamine::tetrahydroisoquinoline (THIQ), 20
SMILES CN(C)CCCCN1CC(c2ccccc2)c2ccc(C)c(C)c2C1
InChI Key InChIKey=ZIQVUHSXFIVRAX-UHFFFAOYSA-N
Data  1 IC50
  Tab Delimited (TSV)   2D SDfile   Computed 3D by Vconf -m prep SDfile
Find this compound or compounds like it in BindingDB:
Activity Spreadsheet -- Enzyme Inhibition Constant Data from BindingDB
Found 1 hit for monomerid = 24115
TargetKinesin-like protein KIF11(Homo sapiens (Human))
Bristol-Myers Squibb
LigandPNGBDBM24115([4-(7,8-dimethyl-4-phenyl-1,2,3,4-tetrahydroisoqui...)
Affinity DataIC50:  5.36E+3nMpH: 7.0 T: 2°C. Assay description: ATPase assays with Eg5 motor domain protein were performed using Kinase-Glo Luminescent Kit as described by the manufacturer (Promega).
In DepthDetails ArticlePubMed