BDBM241200 US11046688, Example 42::US9409907, 42
SMILES COc1cc(ccc1Nc1ncc2ccnc(NC3CCCCC3)c2n1)-c1cnn(CCN(C)C)c1
InChI Key InChIKey=RYZHXIWLTSDXMA-UHFFFAOYSA-N
Data  2 IC50
  Tab Delimited (TSV)   2D SDfile   Computed 3D by Vconf -m prep SDfile
Find this compound or compounds like it in BindingDB:
Activity Spreadsheet -- Enzyme Inhibition Constant Data from BindingDB
Found 2 hits for monomerid = 241200
TargetDual specificity protein kinase TTK(Homo sapiens (Human))
Cancer Research Technology
US Patent
LigandPNGBDBM241200(US11046688, Example 42 | US9409907, 42)
Affinity DataIC50:  3nM. Assay description: The enzyme reaction (total volume 10 μl) was carried out in black 384-well low volume plates containing full length MPS1 (12.5 nM or 3 nM), fluo...
Ligand InfoPC cidPC sid
TargetDual specificity protein kinase TTK(Homo sapiens (Human))
Cancer Research Technology
US Patent
LigandPNGBDBM241200(US11046688, Example 42 | US9409907, 42)
Affinity DataIC50:  3nMpH: 7.0 T: 2°C. Assay description: The enzyme reaction (total volume 10 μl) was carried out in black 384-well low volume plates containing full length MPS1 (12.5 nM or 3 nM), fluo...
Ligand InfoPC cidPC sid
In DepthDetails US Patent