BDBM241233 US10479788, Example 75::US11046688, Example 75::US9409907, 75
SMILES COc1cc(ccc1Nc1ncc2ccnc(NC(C)C3CC3)c2n1)-c1cnn(C)c1
InChI Key InChIKey=XQNVJAORESMLSK-UHFFFAOYSA-N
Data  3 IC50
  Tab Delimited (TSV)   2D SDfile   Computed 3D by Vconf -m prep SDfile
Find this compound or compounds like it in BindingDB:
Activity Spreadsheet -- Enzyme Inhibition Constant Data from BindingDB
Found 3 hits for monomerid = 241233
TargetDual specificity protein kinase TTK(Homo sapiens (Human))
Cancer Research Technology
US Patent
LigandPNGBDBM241233(US10479788, Example 75 | US11046688, Example 75 | ...)
Affinity DataIC50:  4nMpH: 7.0 T: 2°C. Assay description: The enzyme reaction (total volume 10 μl) was carried out in black 384-well low volume plates containing full length MPS1 (12.5 nM or 3 nM), fluo...
Ligand InfoPC cidPC sid
In DepthDetails US Patent
TargetDual specificity protein kinase TTK(Homo sapiens (Human))
Cancer Research Technology
US Patent
LigandPNGBDBM241233(US10479788, Example 75 | US11046688, Example 75 | ...)
Affinity DataIC50:  4nM. Assay description: The enzyme reaction (total volume 10 μl) was carried out in black 384-well low volume plates containing full length MPS1 (12.5 nM or 3 nM), fluo...
Ligand InfoPC cidPC sid
TargetDual specificity protein kinase TTK(Homo sapiens (Human))
Cancer Research Technology
US Patent
LigandPNGBDBM241233(US10479788, Example 75 | US11046688, Example 75 | ...)
Affinity DataIC50:  4nM. Assay description: The enzyme reaction (total volume 10 μl) was carried out in black 384-well low volume plates containing full length MPS1 (12.5 nM or 3 nM), fluo...
Ligand InfoPC cidPC sid
In DepthDetails US Patent