BDBM243208 (s)-n-(1-(2-fluorobenzyl)piperidin-3-yl)-5,5-dimethyl-2-((tetrahydro-2h-pyran-4-yl)amino)-5h-pyrrolo[3,4-d]pyrimidine-6(7h)-carboxamide::US9546173, cmpd 5
SMILES CC1(C)N(Cc2nc(NC3CCOCC3)ncc12)C(=O)N[C@H]1CCCN(Cc2ccccc2F)C1
InChI Key InChIKey=KKLDHNQTYMEBJK-FQEVSTJZSA-N
Data  1 IC50
  Tab Delimited (TSV)   2D SDfile   Computed 3D by Vconf -m prep SDfile
Find this compound or compounds like it in BindingDB:
Activity Spreadsheet -- Enzyme Inhibition Constant Data from BindingDB
Found 1 hit for monomerid = 243208
TargetMitogen-activated protein kinase 1(Homo sapiens (Human))
Novartis
US Patent
LigandPNGBDBM243208((s)-n-(1-(2-fluorobenzyl)piperidin-3-yl)-5,5-dimet...)
Affinity DataIC50:  1.55E+4nMpH: 7.5Assay Description:Compound potency against activated ERK2 was determined using a kinase assay that measures ERK2-catalyzed phosphorylation of biotinylated ERKtide pept...
Ligand InfoPC cidPC sid
In DepthDetails US Patent