BDBM243243 (s)-5,5-dimethyl-n-(1-phenylethyl)-2-((tetrahydro-2h-pyran-4-yl)amino)-5h-pyrrolo[3,4-d]pyrimidine-6(7h)-carboxamide::US9546173, cmpd 40
SMILES C[C@H](NC(=O)N1Cc2nc(NC3CCOCC3)ncc2C1(C)C)c1ccccc1
InChI Key InChIKey=HWWLPSCQJFBUIC-HNNXBMFYSA-N
Data  1 IC50
  Tab Delimited (TSV)   2D SDfile   Computed 3D by Vconf -m prep SDfile
Find this compound or compounds like it in BindingDB:
Activity Spreadsheet -- Enzyme Inhibition Constant Data from BindingDB
Found 1 hit for monomerid = 243243
TargetMitogen-activated protein kinase 1(Homo sapiens (Human))
Novartis
US Patent
LigandPNGBDBM243243((s)-5,5-dimethyl-n-(1-phenylethyl)-2-((tetrahydro-...)
Affinity DataIC50:  799nMpH: 7.5Assay Description:Compound potency against activated ERK2 was determined using a kinase assay that measures ERK2-catalyzed phosphorylation of biotinylated ERKtide pept...
Ligand InfoPC cidPC sid
In DepthDetails US Patent