BDBM243255 (s)-2-((3,3-difluorocyclobutyl)amino)-n-(2-hydroxy-1-phenylethyl)-5,5-dimethyl-5h-pyrrolo[3,4-d]pyrimidine-6(7h)-carboxamide::US9546173, cmpd 54
SMILES CC1(C)N(Cc2nc(NC3CC(F)(F)C3)ncc12)C(=O)N[C@H](CO)c1ccccc1
InChI Key InChIKey=ZOFKWMJINJLWPY-QGZVFWFLSA-N
Data  1 IC50
  Tab Delimited (TSV)   2D SDfile   Computed 3D by Vconf -m prep SDfile
Find this compound or compounds like it in BindingDB:
Activity Spreadsheet -- Enzyme Inhibition Constant Data from BindingDB
Found 1 hit for monomerid = 243255
TargetMitogen-activated protein kinase 1(Homo sapiens (Human))
Novartis
US Patent
LigandPNGBDBM243255((s)-2-((3,3-difluorocyclobutyl)amino)-n-(2-hydroxy...)
Affinity DataIC50:  727nMpH: 7.5Assay Description:Compound potency against activated ERK2 was determined using a kinase assay that measures ERK2-catalyzed phosphorylation of biotinylated ERKtide pept...
Ligand InfoPC cidPC sid
In DepthDetails US Patent