BDBM243479 US9427440, 27
SMILES CN1CCCCCNC(=O)C2=Cc3ccc(Cl)cc3-c3c(C4CCCCC4)c4ccc(cc4n3C2)C(=O)NS1(=O)=O
InChI Key InChIKey=ZIKZKHLOSYZXCA-UHFFFAOYSA-N
Data  1 Kd  1 EC50  1 Koff  1 Kon
  Tab Delimited (TSV)   2D SDfile   Computed 3D by Vconf -m prep SDfile
Find this compound or compounds like it in BindingDB:
Activity Spreadsheet -- Enzyme Inhibition Constant Data from BindingDB
Found 3 hits for monomerid = 243479
TargetGenome polyprotein [1027-3010](Hepatitis C virus genotype 1b (strain HC-J4) (HCV))
Janssen Ireland
US Patent
LigandPNGBDBM243479(US9427440, 27)
Affinity DataEC50:  1.02E+4nM. Assay description: The assay utilized the stably transfected cell line Huh-7 luc/neo (hereafter referred to as Huh-Luc). This cell line harbors an RNA encoding a bicist...
Ligand InfoPC cidPC sid
In DepthDetails US Patent
TargetGenome polyprotein [2420-3010](Hepatitis C virus genotype 1b (isolate Con1) (HCV))
Janssen Ireland
US Patent
LigandPNGBDBM243479(US9427440, 27)
Affinity DataKon:  0.00380M-1s-1 Koff:  9.50E+3s-1pH: 7.4 T: 2°C. Assay description: All measurements were performed on a Biacore T100 instrument (GE Healthcare). The purified HIS6-tagged NS5BΔC21 polymerases were immobilized us...
Ligand InfoPC cidPC sid
In DepthDetails US Patent
TargetGenome polyprotein [2420-3010](Hepatitis C virus genotype 1b (isolate Con1) (HCV))
Janssen Ireland
US Patent
LigandPNGBDBM243479(US9427440, 27)
Affinity DataKd:  400nMpH: 7.4 T: 2°C. Assay description: All measurements were performed on a Biacore T100 instrument (GE Healthcare). The purified HIS6-tagged NS5BΔC21 polymerases were immobilized us...
Ligand InfoPC cidPC sid
In DepthDetails US Patent