BDBM243481 US9427440, 38
SMILES COc1ccc2-c3c(C4CCCCC4)c4ccc5cc4n3CC(=Cc2c1)C(=O)NCCCCN(C)S(=O)(=O)NC5=O
InChI Key InChIKey=VASGGYKYDYEGLH-UHFFFAOYSA-N
Data  1 Kd  1 EC50  1 Koff  1 Kon
  Tab Delimited (TSV)   2D SDfile   Computed 3D by Vconf -m prep SDfile
Find this compound or compounds like it in BindingDB:
Activity Spreadsheet -- Enzyme Inhibition Constant Data from BindingDB
Found 3 hits for monomerid = 243481
TargetGenome polyprotein [1027-3010](Hepatitis C virus genotype 1b (strain HC-J4) (HCV))
Janssen Ireland
US Patent
LigandPNGBDBM243481(US9427440, 38)
Affinity DataEC50:  912nM. Assay description: The assay utilized the stably transfected cell line Huh-7 luc/neo (hereafter referred to as Huh-Luc). This cell line harbors an RNA encoding a bicist...
Ligand InfoPC cidPC sid
In DepthDetails US Patent
TargetGenome polyprotein [2420-3010](Hepatitis C virus genotype 1b (isolate Con1) (HCV))
Janssen Ireland
US Patent
LigandPNGBDBM243481(US9427440, 38)
Affinity DataKon:  0.0000410M-1s-1 Koff:  5.30E+3s-1pH: 7.4 T: 2°C. Assay description: All measurements were performed on a Biacore T100 instrument (GE Healthcare). The purified HIS6-tagged NS5BΔC21 polymerases were immobilized us...
Ligand InfoPC cidPC sid
In DepthDetails US Patent
TargetGenome polyprotein [2420-3010](Hepatitis C virus genotype 1b (isolate Con1) (HCV))
Janssen Ireland
US Patent
LigandPNGBDBM243481(US9427440, 38)
Affinity DataKd:  7.70nMpH: 7.4 T: 2°C. Assay description: All measurements were performed on a Biacore T100 instrument (GE Healthcare). The purified HIS6-tagged NS5BΔC21 polymerases were immobilized us...
Ligand InfoPC cidPC sid
In DepthDetails US Patent