BDBM24363 2-chloro-N-(2-oxo-1,2,3,4-tetrahydroquinolin-3-yl)-6H-thieno[2,3-b]pyrrole-5-carboxamide::3,4-dihydro-2-quinolone (DHQ) derivative, 2::CHEMBL218287
SMILES Clc1cc2cc([nH]c2s1)C(=O)NC1Cc2ccccc2NC1=O
InChI Key InChIKey=LJAHIGGEXIWVJG-UHFFFAOYSA-N
Data  2 IC50
PDB links: 1 PDB ID matches this monomer.
  Tab Delimited (TSV)   2D SDfile   Computed 3D by Vconf -m prep SDfile
Find this compound or compounds like it in BindingDB:
Activity Spreadsheet -- Enzyme Inhibition Constant Data from BindingDB
Found 2 hits for monomerid = 24363
TargetGlycogen phosphorylase, liver form(Homo sapiens (Human))
Astrazeneca
Curated by ChEMBL
LigandPNGBDBM24363(2-chloro-N-(2-oxo-1,2,3,4-tetrahydroquinolin-3-yl)...)
Affinity DataIC50:  41nM. Assay description: Inhibition of recombinant human liver GPa by multienzyme coupled assay
In DepthDetails ArticlePubMed
TargetGlycogen phosphorylase, liver form(Homo sapiens (Human))
Astrazeneca
Curated by ChEMBL
LigandPNGBDBM24363(2-chloro-N-(2-oxo-1,2,3,4-tetrahydroquinolin-3-yl)...)
Affinity DataIC50:  41nMpH: 7.2 T: 2°C. Assay description: The inhibitory activity of the test compounds against human recombinant glycogen phosphorylase a (GPa) was monitored using 96-well microplate format....
In DepthDetails ArticlePubMed