BDBM244009 (r)-5-ethyl-n-((s)-2-hydroxy-1-phenylethyl)-5-methyl-2-((tetrahydro-2h-pyran-4-yl)amino)-5h-pyrrolo[3,4-d]pyrimidine-6(7h)-carboxamide::US9546173, cmpd 80
SMILES CC[C@@]1(C)N(Cc2nc(NC3CCOCC3)ncc12)C(=O)N[C@H](CO)c1ccccc1
InChI Key InChIKey=ZMIXJNQMYIWZES-NFBKMPQASA-N
Data  1 IC50
  Tab Delimited (TSV)   2D SDfile   Computed 3D by Vconf -m prep SDfile
Find this compound or compounds like it in BindingDB:
Activity Spreadsheet -- Enzyme Inhibition Constant Data from BindingDB
Found 1 hit for monomerid = 244009
TargetMitogen-activated protein kinase 1(Homo sapiens (Human))
Novartis
US Patent
LigandPNGBDBM244009((r)-5-ethyl-n-((s)-2-hydroxy-1-phenylethyl)-5-meth...)
Affinity DataIC50:  22nMpH: 7.5Assay Description:Compound potency against activated ERK2 was determined using a kinase assay that measures ERK2-catalyzed phosphorylation of biotinylated ERKtide pept...
Ligand InfoPC cidPC sid
In DepthDetails US Patent