BDBM244075 US9428478, TG6-190
SMILES COc1ccc(cc1)N1CCN(CC1)C(=O)c1[nH]c2ccc(cc2c1C)C(C)=O
InChI Key InChIKey=KNBHCSFZFNPVBO-UHFFFAOYSA-N
Data  1 IC50
  Tab Delimited (TSV)   2D SDfile   Computed 3D by Vconf -m prep SDfile
Find this compound or compounds like it in BindingDB:
Activity Spreadsheet -- Enzyme Inhibition Constant Data from BindingDB
Found 1 hit for monomerid = 244075
TargetCytochrome b-245 heavy chain(Homo sapiens (Human))
Emory University
US Patent
LigandPNGBDBM244075(US9428478, TG6-190)
Affinity DataIC50:  1.00E+9nM. Assay description: Nox2 activity assay for primary screening: Plasma membranes were prepared from human neutrophils, which express large amounts of Nox2, stored at W...
Ligand InfoPC cidPC sid
In DepthDetails US Patent