BDBM244086 US9428478, TG6-236
SMILES COc1ccc(cc1)N1CCN(CC1)C(=O)c1cc2cc(ccc2[nH]1)C(O)=O
InChI Key InChIKey=CKKZNPZWHVNQKG-UHFFFAOYSA-N
Data  2 IC50
  Tab Delimited (TSV)   2D SDfile   Computed 3D by Vconf -m prep SDfile
Find this compound or compounds like it in BindingDB:
Activity Spreadsheet -- Enzyme Inhibition Constant Data from BindingDB
Found 2 hits for monomerid = 244086
TargetXanthine dehydrogenase/oxidase(Homo sapiens (Human))
Emory University
US Patent
LigandPNGBDBM244086(US9428478, TG6-236)
Affinity DataIC50: >2.00E+10nM. Assay description: Assay controls. To rule out interference with either Nox2 or Nox4 luminescence assays, two approaches are used. In one, xanthine oxidase replaces the...
Ligand InfoPC cidPC sid
In DepthDetails US Patent
TargetCytochrome b-245 heavy chain(Homo sapiens (Human))
Emory University
US Patent
LigandPNGBDBM244086(US9428478, TG6-236)
Affinity DataIC50:  5.00E+8nM. Assay description: Nox2 activity assay for primary screening: Plasma membranes were prepared from human neutrophils, which express large amounts of Nox2, stored at W...
Ligand InfoPC cidPC sid
In DepthDetails US Patent