BDBM244090 US9428478, TG6-252
SMILES COc1ccc(cc1F)N1CCN(CC1)C(=O)c1cc2cc(ccc2[nH]1)C(C)=O
InChI Key InChIKey=HSXCUXNNSFVXBU-UHFFFAOYSA-N
Data  1 IC50
  Tab Delimited (TSV)   2D SDfile   Computed 3D by Vconf -m prep SDfile
Find this compound or compounds like it in BindingDB:
Activity Spreadsheet -- Enzyme Inhibition Constant Data from BindingDB
Found 1 hit for monomerid = 244090
TargetCytochrome b-245 heavy chain(Homo sapiens (Human))
Emory University
US Patent
LigandPNGBDBM244090(US9428478, TG6-252)
Affinity DataIC50:  3.00E+9nM. Assay description: Nox2 activity assay for primary screening: Plasma membranes were prepared from human neutrophils, which express large amounts of Nox2, stored at W...
Ligand InfoPC cidPC sid
In DepthDetails US Patent