BDBM244166 US9546173, cmpd 96::n-phenethyl-2'-((tetrahydro-2h-pyran-4-yl)amino)spiro[cyclobutane-1,5'-pyrrolo[3,4-d]pyrimidine]-6'(7'h)-carboxamide
SMILES O=C(NCCc1ccccc1)N1Cc2nc(NC3CCOCC3)ncc2C11CCC1
InChI Key InChIKey=KFTOZYWHDJUJAP-UHFFFAOYSA-N
Data  1 IC50
  Tab Delimited (TSV)   2D SDfile   Computed 3D by Vconf -m prep SDfile
Find this compound or compounds like it in BindingDB:
Activity Spreadsheet -- Enzyme Inhibition Constant Data from BindingDB
Found 1 hit for monomerid = 244166
TargetMitogen-activated protein kinase 1(Homo sapiens (Human))
Novartis
US Patent
LigandPNGBDBM244166(US9546173, cmpd 96 | n-phenethyl-2'-((tetrahyd...)
Affinity DataIC50:  90nMpH: 7.5Assay Description:Compound potency against activated ERK2 was determined using a kinase assay that measures ERK2-catalyzed phosphorylation of biotinylated ERKtide pept...
Ligand InfoPC cidPC sid
In DepthDetails US Patent