BDBM244177 5,5-dimethyl-n-(3-(propylsulfonyl)benzyl)-2-((tetrahydro-2h-pyran-4-yl)amino)-5h-pyrrolo[3,4-d]pyrimidine-6(7h)-carboxamide::US9546173, cmpd 110
SMILES CCCS(=O)(=O)c1cccc(CNC(=O)N2Cc3nc(NC4CCOCC4)ncc3C2(C)C)c1
InChI Key InChIKey=CWXCLSXTRZQRCF-UHFFFAOYSA-N
Data  1 IC50
  Tab Delimited (TSV)   2D SDfile   Computed 3D by Vconf -m prep SDfile
Find this compound or compounds like it in BindingDB:
Activity Spreadsheet -- Enzyme Inhibition Constant Data from BindingDB
Found 1 hit for monomerid = 244177
TargetMitogen-activated protein kinase 1(Homo sapiens (Human))
Novartis
US Patent
LigandPNGBDBM244177(5,5-dimethyl-n-(3-(propylsulfonyl)benzyl)-2-((tetr...)
Affinity DataIC50:  39nMpH: 7.5Assay Description:Compound potency against activated ERK2 was determined using a kinase assay that measures ERK2-catalyzed phosphorylation of biotinylated ERKtide pept...
Ligand InfoPC cidPC sid
In DepthDetails US Patent