BDBM244183 (s)-n-(1-(3-fluoro-5-(methylsulfonyl)phenyl)ethyl)-5,5-dimethyl-2-((tetrahydro-2h-pyran-4-yl)amino)-5h-pyrrolo[3,4-d]pyrimidine-6(7h)-carboxamide::US9546173, cmpd 116
SMILES C[C@H](NC(=O)N1Cc2nc(NC3CCOCC3)ncc2C1(C)C)c1cc(F)cc(c1)S(C)(=O)=O
InChI Key InChIKey=LTRDASOEKVTOFW-AWEZNQCLSA-N
Data  1 IC50
  Tab Delimited (TSV)   2D SDfile   Computed 3D by Vconf -m prep SDfile
Find this compound or compounds like it in BindingDB:
Activity Spreadsheet -- Enzyme Inhibition Constant Data from BindingDB
Found 1 hit for monomerid = 244183
TargetMitogen-activated protein kinase 1(Homo sapiens (Human))
Novartis
US Patent
LigandPNGBDBM244183((s)-n-(1-(3-fluoro-5-(methylsulfonyl)phenyl)ethyl)...)
Affinity DataIC50:  457nMpH: 7.5Assay Description:Compound potency against activated ERK2 was determined using a kinase assay that measures ERK2-catalyzed phosphorylation of biotinylated ERKtide pept...
Ligand InfoPC cidPC sid
In DepthDetails US Patent