BDBM244930 US9422293, 157::US9738649, Example 157
SMILES Fc1cc(Nc2nc(nc3CCN(CCc23)c2ncccc2C(F)(F)F)N2CCCCC2)ccc1C(F)(F)F
InChI Key InChIKey=XXVZXYJBYMCVSH-UHFFFAOYSA-N
Data  4 IC50
  Tab Delimited (TSV)   2D SDfile   Computed 3D by Vconf -m prep SDfile
Find this compound or compounds like it in BindingDB:
Activity Spreadsheet -- Enzyme Inhibition Constant Data from BindingDB
Found 4 hits for monomerid = 244930
TargetTransient receptor potential cation channel subfamily V member 1(Homo sapiens (Human))
Janssen Pharmaceutica
US Patent
LigandPNGBDBM244930(US9422293, 157 | US9738649, Example 157)
Affinity DataIC50:  4nMT: 2°C. Assay description: HEK293 cells were transfected with human TRPV1 cloned in pcDNA3.1zeo(+) using the Effectene non-liposomal lipid based transfection kit (Qiagen) (hTRP...
Ligand InfoPC cidPC sid
In DepthDetails US Patent
TargetTransient receptor potential cation channel subfamily V member 1(Rattus norvegicus (rat))
Janssen Pharmaceutica
US Patent
LigandPNGBDBM244930(US9422293, 157 | US9738649, Example 157)
Affinity DataIC50:  70nM. Assay description: The assay was performed as described above, using HEK293 cells transfected with rat TRPV1 (rTRPV1/HEK293). These cells had a geneticin selection mark...
Ligand InfoPC cidPC sid
In DepthDetails US Patent
TargetTransient receptor potential cation channel subfamily V member 1(Homo sapiens (Human))
Janssen Pharmaceutica
US Patent
LigandPNGBDBM244930(US9422293, 157 | US9738649, Example 157)
Affinity DataIC50:  4nM. Assay description: HEK293 cells were transfected with human TRPV1 cloned in pcDNA3.1zeo(+) using the Effectene non-liposomal lipid based transfection kit (Qiagen) (hTRP...
Ligand InfoPC cidPC sid
In DepthDetails US Patent
TargetTransient receptor potential cation channel subfamily V member 1(Rattus norvegicus (rat))
Janssen Pharmaceutica
US Patent
LigandPNGBDBM244930(US9422293, 157 | US9738649, Example 157)
Affinity DataIC50:  70nMT: 2°C. Assay description: The assay was performed as described below, using HEK293 cells transfected with rat TRPV1 (rTRPV1/HEK293). These cells had a geneticin selection mark...
Ligand InfoPC cidPC sid
In DepthDetails US Patent