BDBM24752 2-benzyl-5-[3-fluoro-4-({6-methoxy-7-[3-(pyrrolidin-1-yl)propoxy]quinolin-4-yl}oxy)phenyl]-3-methyl-3,4-dihydropyrimidin-4-one::pyrimidone, 23
SMILES COc1cc2c(Oc3ccc(cc3F)-c3cnc(Cc4ccccc4)n(C)c3=O)ccnc2cc1OCCCN1CCCC1
InChI Key InChIKey=KJIYUIPYOIACDW-UHFFFAOYSA-N
Data  1 KI  1 IC50
  Tab Delimited (TSV)   2D SDfile   Computed 3D by Vconf -m prep SDfile
Find this compound or compounds like it in BindingDB:
Activity Spreadsheet -- Enzyme Inhibition Constant Data from BindingDB
Found 2 hits for monomerid = 24752
TargetHepatocyte growth factor receptor(Homo sapiens (Human))
Amgen
LigandPNGBDBM24752(2-benzyl-5-[3-fluoro-4-({6-methoxy-7-[3-(pyrrolidi...)
Affinity DataKi:  12nM ΔG°:  -10.7kcal/molepH: 7.5 T: 2°C. Assay description: In vitro kinase assays were done to establish IC50 values against recombinant enzymes using homogeneous time-resolved fluorescence (HTRF) assay. For ...
In DepthDetails ArticlePubMed
TargetHepatocyte growth factor receptor(Homo sapiens (Human))
Amgen
LigandPNGBDBM24752(2-benzyl-5-[3-fluoro-4-({6-methoxy-7-[3-(pyrrolidi...)
Affinity DataIC50:  12nM. Assay description: Inhibition of human c-MET
In DepthDetails ArticlePubMed