BDBM250694 US9447148, 9.63
SMILES CCCC[C@H](NC(C)=O)C(=O)N[C@H]1CCC(=O)NCC[C@H](NC(=O)[C@H](CCCNC(N)=N)NC(=O)[C@@H](Cc2ccc(C)cc2)NC(=O)[C@H](CCCN)NC1=O)C(N)=O
InChI Key InChIKey=OLBFXUPENABWTP-NXUCNJKMSA-N
Data  2 KI  1 EC50
  Tab Delimited (TSV)   2D SDfile   Computed 3D by Vconf -m prep SDfile
Find this compound or compounds like it in BindingDB:
Activity Spreadsheet -- Enzyme Inhibition Constant Data from BindingDB
Found 3 hits for monomerid = 250694
TargetMelanocyte-stimulating hormone receptor(Homo sapiens (Human))
Palatin Technologies
US Patent
LigandPNGBDBM250694(US9447148, 9.63)
Affinity DataKi:  3nM ΔG°:  -12.1kcal/molepH: 7.5 T: 2°C. Assay description: A competitive inhibition binding assay was performed using membrane homogenates prepared from HEK-293 cells that express recombinant hMCR-1a or hMCR-...
Ligand InfoPC cidPC sid
In DepthDetails US Patent
TargetMelanocortin receptor 4(Homo sapiens (Human))
Palatin Technologies
US Patent
LigandPNGBDBM250694(US9447148, 9.63)
Affinity DataKi:  1.00E+4nM ΔG°:  -7.09kcal/molepH: 7.5 T: 2°C. Assay description: A competitive inhibition binding assay was performed using membrane homogenates prepared from HEK-293 cells that express recombinant hMCR-1a or hMCR-...
Ligand InfoPC cidPC sid
In DepthDetails US Patent
TargetMelanocyte-stimulating hormone receptor(Homo sapiens (Human))
Palatin Technologies
US Patent
LigandPNGBDBM250694(US9447148, 9.63)
Affinity DataEC50:  0.0760nMpH: 7.5 T: 2°C. Assay description: Accumulation of intracellular cAMP was examined as a measure of the ability of the peptides of the present invention to elicit a functional response ...
Ligand InfoPC cidPC sid
In DepthDetails US Patent