BDBM25202 2-N-(3-chloro-4-methoxyphenyl)-4-N-(3,4,5-trimethoxyphenyl)-1,3,5-triazine-2,4-diamine::Bis-anilinotriazine, 2
SMILES COc1ccc(Nc2ncnc(Nc3cc(OC)c(OC)c(OC)c3)n2)cc1Cl
InChI Key InChIKey=ZVWFECUPYCFYBL-UHFFFAOYSA-N
Data  1 IC50
PDB links: 1 PDB ID matches this monomer.
  Tab Delimited (TSV)   2D SDfile   Computed 3D by Vconf -m prep SDfile
Find this compound or compounds like it in BindingDB:
Activity Spreadsheet -- Enzyme Inhibition Constant Data from BindingDB
Found 1 hit for monomerid = 25202
TargetEphrin type-B receptor 4(Homo sapiens (Human))
Astrazeneca
LigandPNGBDBM25202(2-N-(3-chloro-4-methoxyphenyl)-4-N-(3,4,5-trimetho...)
Affinity DataIC50:  1.60E+4nMpH: 7.4 T: 2°C. Assay description: This assay detects inhibitors of EphB4-mediated phosphorylation of a polypeptide substrate using Alphascreen luminescence detection technology. The r...