BDBM25359 4-(cyclohexylamino)-1-(3-fluorophenyl)-1,3,8-triazaspiro[4.5]dec-3-en-2-one::Spiropiperidine Iminohydantoin, 14
SMILES OC1=NC(=NC2CCCCC2)C2(CCNCC2)N1c1cccc(F)c1
InChI Key InChIKey=CLSHIGIZZCVNHG-UHFFFAOYSA-N
Data  1 IC50
  Tab Delimited (TSV)   2D SDfile   Computed 3D by Vconf -m prep SDfile
Find this compound or compounds like it in BindingDB:
Activity Spreadsheet -- Enzyme Inhibition Constant Data from BindingDB
Found 1 hit for monomerid = 25359
TargetBeta-secretase 1(Homo sapiens (Human))
Merck Research Laboratories
LigandPNGBDBM25359(4-(cyclohexylamino)-1-(3-fluorophenyl)-1,3,8-triaz...)
Affinity DataIC50: >1.00E+5nMpH: 4.5 T: 2°C. Assay description: The assay was performed using a 96-well format on a HPLC equipped with four 96-well plate holders. After the reaction was terminated, the solution wa...
In DepthDetails ArticlePubMed