BDBM253625 US9701672, 56
SMILES FC(F)(F)CCCOc1ccc(c(Cl)c1)[C@@]1(CC(c2ccc(s2)C2CC2)=C(c2nnn[nH]2)C(=O)N1)C(F)(F)F
InChI Key
Data  1 IC50
  Tab Delimited (TSV)   2D SDfile   Computed 3D by Vconf -m prep SDfile
Find this compound or compounds like it in BindingDB:
Activity Spreadsheet -- Enzyme Inhibition Constant Data from BindingDB
Found 1 hit for monomerid = 253625
TargetAlpha-1,6-mannosyl-glycoprotein 2-beta-N-acetylglucosaminyltransferase(Homo sapiens (Human))
Bristol-Myers Squibb
US Patent
LigandPNGBDBM253625(US9701672, 56)
Affinity DataIC50:  0.200nMpH: 7.4Assay Description:The MGAT enzyme reactions were performed in Corning FALCONŽ 96-well polypropylene plates, in a total volume of 60 μL of 50 mM potassium phosphat...
Ligand InfoPC cidPC sid
In DepthDetails US Patent