BDBM254057 US9493430, 681
SMILES C[C@H]1[C@H](OC(=O)N1CC1=C(CCC(C)(C)C1)c1ccc(F)c(c1)-c1ccc(cc1C)C(O)=O)c1cc(cc(c1)C(F)(F)F)C(F)(F)F
InChI Key InChIKey=OAHSQQZOHRNRJR-ADSBAMQRSA-N
Data  1 IC50
  Tab Delimited (TSV)   2D SDfile   Computed 3D by Vconf -m prep SDfile
Find this compound or compounds like it in BindingDB:
Activity Spreadsheet -- Enzyme Inhibition Constant Data from BindingDB
Found 1 hit for monomerid = 254057
TargetCholesteryl ester transfer protein(Homo sapiens (Human))
Chong Kun Dang Pharmaceutical
US Patent
LigandPNGBDBM254057(US9493430, 681)
Affinity DataIC50:  6.60nM. Assay description: As a protein source for cholesteryl ester transfer, plasma from healthy persons was used, and as a cholesteryl ester receptor, LDL from healthy perso...
Ligand InfoPC cidPC sid
In DepthDetails US Patent