BDBM25421 2-(2,4-dichlorophenoxy)-5-(3-phenylpropyl)phenol::Triclosan derivative, 22
SMILES Oc1cc(CCCc2ccccc2)ccc1Oc1ccc(Cl)cc1Cl
InChI Key InChIKey=MJRPBNSOVIMDHN-UHFFFAOYSA-N
Data  1 IC50
PDB links: 1 PDB ID matches this monomer.
  Tab Delimited (TSV)   2D SDfile   Computed 3D by Vconf -m prep SDfile
Find this compound or compounds like it in BindingDB:
Activity Spreadsheet -- Enzyme Inhibition Constant Data from BindingDB
Found 1 hit for monomerid = 25421
TargetEnoyl-ACP reductase(Plasmodium falciparum)
Jacobus Pharmaceutical
LigandPNGBDBM25421(2-(2,4-dichlorophenoxy)-5-(3-phenylpropyl)phenol |...)
Affinity DataIC50:  440nMpH: 7.9 T: 2°C. Assay description: PfENR inhibition assays were carried out on a Cary 100 Bio Spectrophotometer or POLARstar Optima by monitoring oxidation of NADH at 340 nm. The IC50 ...