BDBM25422 3-chloro-4-[2-hydroxy-4-(pyridin-2-yl)phenoxy]benzonitrile::Triclosan derivative, 23
SMILES Oc1cc(ccc1Oc1ccc(cc1Cl)C#N)-c1ccccn1
InChI Key InChIKey=CSJXWYZNRAVKKT-UHFFFAOYSA-N
Data  2 IC50
PDB links: 1 PDB ID matches this monomer.
  Tab Delimited (TSV)   2D SDfile   Computed 3D by Vconf -m prep SDfile
Find this compound or compounds like it in BindingDB:
Activity Spreadsheet -- Enzyme Inhibition Constant Data from BindingDB
Found 2 hits for monomerid = 25422
TargetEnoyl-acyl-carrier protein reductase(Plasmodium falciparum)
International Centre For Science And High Technology
Curated by ChEMBL
LigandPNGBDBM25422(3-chloro-4-[2-hydroxy-4-(pyridin-2-yl)phenoxy]benz...)
Affinity DataIC50:  700nM. Assay description: Inhibition of Plasmodium falciparum enoyl-acyl carrier protein reductase
TargetEnoyl-ACP reductase(Plasmodium falciparum)
Jacobus Pharmaceutical
LigandPNGBDBM25422(3-chloro-4-[2-hydroxy-4-(pyridin-2-yl)phenoxy]benz...)
Affinity DataIC50:  700nMpH: 7.9 T: 2°C. Assay description: PfENR inhibition assays were carried out on a Cary 100 Bio Spectrophotometer or POLARstar Optima by monitoring oxidation of NADH at 340 nm. The IC50 ...