BDBM254584 US10214477, Example 43::US9469597, 43::US9670136, 43 N1-((trans)-2-(4-(1H-pyrazol-5-yl)phenyl)cyclopropyl)cyclohexane-1,4-diamine
SMILES NC1CCC(CC1)N[C@H]1C[C@@H]1c1ccc(cc1)-c1ccn[nH]1
InChI Key
Data  9 IC50
  Tab Delimited (TSV)   2D SDfile   Computed 3D by Vconf -m prep SDfile
Find this compound or compounds like it in BindingDB:
Activity Spreadsheet -- Enzyme Inhibition Constant Data from BindingDB
Found 9 hits for monomerid = 254584
TargetAmine oxidase [flavin-containing] A(Homo sapiens (Human))
Oryzon Genomics
US Patent
LigandPNGBDBM254584(US10214477, Example 43 | US9469597, 43 | US9670136...)
Affinity DataIC50: >1.00E+5nMpH: 7.5 T: 2°C. Assay description: In order to monitor MAO enzymatic activities and/or their inhibition rate by inhibitor(s) of interest, a fluorescence-based (inhibitor)-screening ass...
Ligand InfoPC cidPC sid
In DepthDetails US Patent
TargetAmine oxidase [flavin-containing] B(Homo sapiens (Human))
Oryzon Genomics
US Patent
LigandPNGBDBM254584(US10214477, Example 43 | US9469597, 43 | US9670136...)
Affinity DataIC50: >1.00E+5nMpH: 7.5 T: 2°C. Assay description: In order to monitor MAO enzymatic activities and/or their inhibition rate by inhibitor(s) of interest, a fluorescence-based (inhibitor)-screening ass...
Ligand InfoPC cidPC sid
In DepthDetails US Patent
TargetGlutathione S-transferase P/Lysine-specific histone demethylase 1A [158-852](Homo sapiens (Human))
Oryzon Genomics
US Patent
LigandPNGBDBM254584(US10214477, Example 43 | US9469597, 43 | US9670136...)
Affinity DataIC50:  22nMpH: 7.4 T: 2°C. Assay description: The compounds of the invention can be tested for their ability to inhibit LSD1. The ability of the compounds of the invention to inhibit LSD1 can be ...
Ligand InfoPC cidPC sid
In DepthDetails US Patent
TargetAmine oxidase [flavin-containing] A(Homo sapiens (Human))
Oryzon Genomics
US Patent
LigandPNGBDBM254584(US10214477, Example 43 | US9469597, 43 | US9670136...)
Affinity DataIC50: >1.00E+5nM. Assay description: Briefly, a fixed amount of MAO (0.25 μg for MAO-A and 0.5 μg for MAO-B) was incubated on ice for 15 minutes in the reaction buffer, in the ...
Ligand InfoPC cidPC sid
In DepthDetails US Patent
TargetLysine-specific histone demethylase 1A(Homo sapiens (Human))
Oryzon Genomics
US Patent
LigandPNGBDBM254584(US10214477, Example 43 | US9469597, 43 | US9670136...)
Affinity DataIC50:  22nM. Assay description: Briefly, a fixed amount of LSD1 was incubated on ice for 15 minutes, in the absence and/or in the presence of at least eight 3-fold serial dilutions ...
Ligand InfoPC cidPC sid
In DepthDetails US Patent
TargetLysine-specific histone demethylase 1A(Homo sapiens (Human))
Oryzon Genomics
US Patent
LigandPNGBDBM254584(US10214477, Example 43 | US9469597, 43 | US9670136...)
Affinity DataIC50:  22nMpH: 7.4 T: 2°C. Assay description: Briefly, a fixed amount of LSD1 was incubated on ice for 15 minutes, in the absence and/or in the presence of at least eight 3-fold serial dilutions ...
Ligand InfoPC cidPC sid
In DepthDetails US Patent
TargetAmine oxidase [flavin-containing] A(Homo sapiens (Human))
Oryzon Genomics
US Patent
LigandPNGBDBM254584(US10214477, Example 43 | US9469597, 43 | US9670136...)
Affinity DataIC50: >1.00E+5nM. Assay description: Briefly, a fixed amount of LSD1 was incubated on ice for 15 minutes, in the absence and/or in the presence of at least eight 3-fold serial dilutions ...
Ligand InfoPC cidPC sid
In DepthDetails US Patent
TargetAmine oxidase [flavin-containing] B(Homo sapiens (Human))
Oryzon Genomics
US Patent
LigandPNGBDBM254584(US10214477, Example 43 | US9469597, 43 | US9670136...)
Affinity DataIC50: >1.00E+5nM. Assay description: Briefly, a fixed amount of LSD1 was incubated on ice for 15 minutes, in the absence and/or in the presence of at least eight 3-fold serial dilutions ...
Ligand InfoPC cidPC sid
In DepthDetails US Patent
TargetAmine oxidase [flavin-containing] B(Homo sapiens (Human))
Oryzon Genomics
US Patent
LigandPNGBDBM254584(US10214477, Example 43 | US9469597, 43 | US9670136...)
Affinity DataIC50: >1.00E+5nM. Assay description: Briefly, a fixed amount of MAO (0.25 μg for MAO-A and 0.5 μg for MAO-B) was incubated on ice for 15 minutes in the reaction buffer, in the ...
Ligand InfoPC cidPC sid
In DepthDetails US Patent