BDBM25835 4-[2-(3-hydroxyphenyl)-1,3-thiazol-4-yl]phenol::hydroxyphenyl substituted thiazole, 7
SMILES Oc1ccc(cc1)-c1csc(n1)-c1cccc(O)c1
InChI Key InChIKey=ROVOGSGRLVCJAM-UHFFFAOYSA-N
Data  1 IC50
  Tab Delimited (TSV)   2D SDfile   Computed 3D by Vconf -m prep SDfile
Find this compound or compounds like it in BindingDB:
Activity Spreadsheet -- Enzyme Inhibition Constant Data from BindingDB
Found 1 hit for monomerid = 25835
Target17-beta-hydroxysteroid dehydrogenase type 1(Homo sapiens (Human))
Saarland University
LigandPNGBDBM25835(4-[2-(3-hydroxyphenyl)-1,3-thiazol-4-yl]phenol | h...)
Affinity DataIC50: >1.00E+3nMpH: 7.0 T: 2°C. Assay description: Tritiated E1 was incubated with 17beta-HSD1, cofactor, and inhibitor. The amount of labeled E2 formed was quantified by HPLC. Detection and quantific...
In DepthDetails ArticlePubMed