BDBM258749 US9499482, 148
SMILES COc1cc(ccc1OCCN(C)CCO)N1CC=C(Oc2ccc(cc2)C2CC2)C1=O
InChI Key InChIKey=FSPMHBCVMHAFTN-UHFFFAOYSA-N
Data  1 KI
  Tab Delimited (TSV)   2D SDfile   Computed 3D by Vconf -m prep SDfile
Find this compound or compounds like it in BindingDB:
Activity Spreadsheet -- Enzyme Inhibition Constant Data from BindingDB
Found 1 hit for monomerid = 258749
TargetMelanin-concentrating hormone receptor 1 [E4Q,A5T](Homo sapiens (Human))
Bristol-Myers Squibb
US Patent
LigandPNGBDBM258749(US9499482, 148)
Affinity DataKi:  0.800nMpH: 7.4Assay Description:An in vitro binding assay was used to determine the compound Ki value or ability to antagonize binding of a peptide agonist to the human melanin conc...
Ligand InfoPC cidPC sid
In DepthDetails US Patent