BDBM2591 (Arylindolyl)maleimide deriv. 13::3,4-bis(1-methyl-1H-indol-3-yl)-2,5-dihydro-1H-pyrrole-2,5-dione::ROCHE screening, 41::bis-indolylmaleimide deriv. 8i
SMILES Cn1cc(C2=C(C(=O)NC2=O)c2cn(C)c3ccccc23)c2ccccc12
InChI Key InChIKey=DWLMLPCWSGBXMZ-UHFFFAOYSA-N
Data  6 IC50
  Tab Delimited (TSV)   2D SDfile   Computed 3D by Vconf -m prep SDfile
Find this compound or compounds like it in BindingDB:
Activity Spreadsheet -- Enzyme Inhibition Constant Data from BindingDB
Found 6 hits for monomerid = 2591
TargetProtein kinase C beta type(Rattus norvegicus (rat))
Roche Products
LigandPNGBDBM2591((Arylindolyl)maleimide deriv. 13 | 3,4-bis(1-methy...)
Affinity DataIC50:  300nMpH: 7.5 T: 2°C. Assay description: The activity of PKC, activated by phosphatidylerine and Ca2+, is measured by its ability to transfer phosphate from [gamma-32P]ATP to lysine-rich his...
In DepthDetails ArticlePubMed
TargetcAMP-dependent protein kinase catalytic subunit alpha(Bos taurus (bovine))
Roche Products
LigandPNGBDBM2591((Arylindolyl)maleimide deriv. 13 | 3,4-bis(1-methy...)
Affinity DataIC50:  1.61E+4nMpH: 8.5 T: 2°C. Assay description: The activity of PKA, activated by cAMP, is measured by its ability to transfer phosphate from [gamma-32P]ATP to histone.
In DepthDetails ArticlePubMed
TargetSerine/threonine-protein kinase TBK1(Homo sapiens (Human))
Technical University Of Dortmund
LigandPNGBDBM2591((Arylindolyl)maleimide deriv. 13 | 3,4-bis(1-methy...)
Affinity DataIC50:  558nM. Assay description: IC50 determinations for TBK1 were performed with the KinEASE-STK assay from Cisbio according to the manufacturer's instructions. A biotinylated s...
In DepthDetails ArticlePubMed
TargetCyclin-dependent kinase 2/G1/S-specific cyclin-E1(Homo sapiens (Human))
Eli Lilly
LigandPNGBDBM2591((Arylindolyl)maleimide deriv. 13 | 3,4-bis(1-methy...)
Affinity DataIC50:  580nMT: 2°C. Assay description: In vitro CDK assay using purified enzyme, was incubated at room temperature with substrate, and test compounds in the presence of ATP/[gamma-33P]ATP....
In DepthDetails ArticlePubMed
TargetcAMP-dependent protein kinase catalytic subunit alpha(Bos taurus (bovine))
Roche Products
LigandPNGBDBM2591((Arylindolyl)maleimide deriv. 13 | 3,4-bis(1-methy...)
Affinity DataIC50: >2.00E+4nMT: 2°C. Assay description: In vitro kinase assay using purified enzyme, was incubated at room temperature with substrate, and test compounds in the presence of ATP/[gamma-33P]A...
In DepthDetails ArticlePubMed
TargetCyclin-dependent kinase 4/G1/S-specific cyclin-D1(Homo sapiens (Human))
Eli Lilly
LigandPNGBDBM2591((Arylindolyl)maleimide deriv. 13 | 3,4-bis(1-methy...)
Affinity DataIC50:  890nMpH: 7.0 T: 2°C. Assay description: In vitro CDK assay using purified enzyme, was incubated at room temperature with substrate, and test compounds in the presence of ATP/[gamma-33P]ATP....
In DepthDetails ArticlePubMed