BDBM260151 US9522910, Table 1 Compound 1: 4-methyl-N-{4-[(4-methylpiperazin-1-yl)methyl]-3-(trifluoromethyl)phenyl}-3-(2-{[1,2,4]triazolo[4,3-a]pyridin-3-yl}ethynyl)benzamide
SMILES CN1CCN(Cc2ccc(NC(=O)c3ccc(C)c(c3)C#Cc3nnc4ccccn34)cc2C(F)(F)F)CC1
InChI Key InChIKey=SLIVDYMORZGPLW-UHFFFAOYSA-N
Data  2 IC50
  Tab Delimited (TSV)   2D SDfile   Computed 3D by Vconf -m prep SDfile
Find this compound or compounds like it in BindingDB:
Activity Spreadsheet -- Enzyme Inhibition Constant Data from BindingDB
Found 2 hits for monomerid = 260151
TargetTyrosine-protein kinase ABL1 [T315I](Homo sapiens (Human))
Obshchestvo S Ogranichennoy Otvetstvennostyou “Fusion Pharma”
US Patent
LigandPNGBDBM260151(US9522910, Table 1 Compound 1: 4-methyl-N-{4-[(4-m...)
Affinity DataIC50: <20nM. Assay description: Kinase activity and inhibition was measured by established protocols (see e.g. Braunwalder et al., A Solid-Phase Assay for the Determination of Prote...
In DepthDetails US Patent
TargetTyrosine-protein kinase ABL1(Homo sapiens (Human))
Obshchestvo S Ogranichennoy Otvetstvennostyou “Fusion Pharma”
US Patent
LigandPNGBDBM260151(US9522910, Table 1 Compound 1: 4-methyl-N-{4-[(4-m...)
Affinity DataIC50: <20nM. Assay description: Kinase activity and inhibition was measured by established protocols (see e.g. Braunwalder et al., A Solid-Phase Assay for the Determination of Prote...
In DepthDetails US Patent