BDBM2609 3-(5-Hydroxy-1-methyl-3-indolyl)-4-(1-methyl-3-indolyl)pyrrole-2,5-dione::3-(5-hydroxy-1-methyl-1H-indol-3-yl)-4-(1-methyl-1H-indol-3-yl)-2,5-dihydro-1H-pyrrole-2,5-dione::Bisindolylmaleimide deriv. 31
SMILES Cn1cc(C2=C(C(=O)NC2=O)c2cn(C)c3ccc(O)cc23)c2ccccc12
InChI Key InChIKey=CQVGLBTZZGJXTR-UHFFFAOYSA-N
Data  1 IC50
  Tab Delimited (TSV)   2D SDfile   Computed 3D by Vconf -m prep SDfile
Find this compound or compounds like it in BindingDB:
Activity Spreadsheet -- Enzyme Inhibition Constant Data from BindingDB
Found 1 hit for monomerid = 2609
TargetProtein kinase C beta type(Rattus norvegicus (rat))
Roche Products
LigandPNGBDBM2609(3-(5-Hydroxy-1-methyl-3-indolyl)-4-(1-methyl-3-ind...)
Affinity DataIC50:  920nM. Assay description: The activity of PKC, activated by phosphatidylerine and Ca2+, is measured by its ability to transfer phosphate from [gamma-32P]ATP to lysine-rich his...
In DepthDetails ArticlePubMed