BDBM2612 3-(1-methyl-1H-indol-3-yl)-4-[1-methyl-5-(methylsulfanyl)-1H-indol-3-yl]-2,5-dihydro-1H-pyrrole-2,5-dione::Bisindolylmaleimide deriv. 34
SMILES CSc1ccc2n(C)cc(C3=C(C(=O)NC3=O)c3cn(C)c4ccccc34)c2c1
InChI Key InChIKey=LNUGXHAKACPLMW-UHFFFAOYSA-N
Data  1 IC50
  Tab Delimited (TSV)   2D SDfile   Computed 3D by Vconf -m prep SDfile
Find this compound or compounds like it in BindingDB:
Activity Spreadsheet -- Enzyme Inhibition Constant Data from BindingDB
Found 1 hit for monomerid = 2612
TargetProtein kinase C beta type(Rattus norvegicus (rat))
Roche Products
LigandPNGBDBM2612(3-(1-methyl-1H-indol-3-yl)-4-[1-methyl-5-(methylsu...)
Affinity DataIC50:  380nM. Assay description: The activity of PKC, activated by phosphatidylerine and Ca2+, is measured by its ability to transfer phosphate from [gamma-32P]ATP to lysine-rich his...
In DepthDetails ArticlePubMed