BDBM2631 3-(1,4-dimethyl-1H-indol-3-yl)-4-(1-methyl-1H-indol-3-yl)-2,5-dihydro-1H-pyrrole-2,5-dione::Bisindolylmaleimide deriv. 53
SMILES Cc1cccc2n(C)cc(C3=C(C(=O)NC3=O)c3cn(C)c4ccccc34)c12
InChI Key InChIKey=XZTXSLFLRRWEIH-UHFFFAOYSA-N
Data  2 IC50
  Tab Delimited (TSV)   2D SDfile   Computed 3D by Vconf -m prep SDfile
Find this compound or compounds like it in BindingDB:
Activity Spreadsheet -- Enzyme Inhibition Constant Data from BindingDB
Found 2 hits for monomerid = 2631
TargetcAMP-dependent protein kinase catalytic subunit alpha(Bos taurus (bovine))
Roche Products
LigandPNGBDBM2631(3-(1,4-dimethyl-1H-indol-3-yl)-4-(1-methyl-1H-indo...)
Affinity DataIC50:  1.30E+4nM. Assay description: The activity of PKA, activated by cAMP, is measured by its ability to transfer phosphate from [gamma-32P]ATP to histone.
In DepthDetails ArticlePubMed
TargetProtein kinase C beta type(Rattus norvegicus (rat))
Roche Products
LigandPNGBDBM2631(3-(1,4-dimethyl-1H-indol-3-yl)-4-(1-methyl-1H-indo...)
Affinity DataIC50:  590nM. Assay description: The activity of PKC, activated by phosphatidylerine and Ca2+, is measured by its ability to transfer phosphate from [gamma-32P]ATP to lysine-rich his...
In DepthDetails ArticlePubMed