BDBM26337 6-{[2-(4,5-dihydro-1H-imidazol-2-ylamino)ethyl]amino}-3-[(4-ethylphenyl)methyl]-1-[(4-methoxyphenyl)methyl]-1,2,3,4-tetrahydro-1,3,5-triazine-2,4-dione::Triazine compound, 3
SMILES [#6]-[#6]-c1ccc(-[#6]-n2c(=O)nc(-[#7]-[#6]-[#6]\[#7]=[#6]-3/[#7]-[#6]-[#6]-[#7]-3)n(-[#6]-c3ccc(-[#8]-[#6])cc3)c2=O)cc1
InChI Key InChIKey=IQQIHJNOLKQKPV-UHFFFAOYSA-N
Data  2 KI
  Tab Delimited (TSV)   2D SDfile   Computed 3D by Vconf -m prep SDfile
Find this compound or compounds like it in BindingDB:
Activity Spreadsheet -- Enzyme Inhibition Constant Data from BindingDB
Found 2 hits for monomerid = 26337
TargetProkineticin receptor 1(Homo sapiens (Human))
University Of Ferrara
LigandPNGBDBM26337(6-{[2-(4,5-dihydro-1H-imidazol-2-ylamino)ethyl]ami...)
Affinity DataKi:  4.72E+3nM ΔG°:  -7.55kcal/molepH: 7.4 T: 2°C. Assay description: Nonspecific binding was determined in the presence of 1 uM Bv8. Displacement curves were determined in triplicate. The inhibition constant (Ki) of th...
In DepthDetails ArticlePubMed
TargetProkineticin receptor 2(Homo sapiens (Human))
University Of Ferrara
LigandPNGBDBM26337(6-{[2-(4,5-dihydro-1H-imidazol-2-ylamino)ethyl]ami...)
Affinity DataKi:  7.12E+4nM ΔG°:  -5.88kcal/molepH: 7.4 T: 2°C. Assay description: Nonspecific binding was determined in the presence of 1 uM Bv8. Displacement curves were determined in triplicate. The inhibition constant (Ki) of th...
In DepthDetails ArticlePubMed